remove the contigious keyword. triggers multiple copies.

21 jobs for 175-mscbdecomp in 20 minutes and 57 seconds (queued for 8 seconds)
latest
Name Stage Failure
failed
GQMCT_Stretch_conv Warnconv
Makefile:13: recipe for target 'entanglement_mod.o' failed
make[2]: Leaving directory '/builds/ALF/ALF/Libraries/Modules'
Makefile:4: recipe for target 'all' failed
make[1]: Leaving directory '/builds/ALF/ALF/Libraries'
make[1]: *** [all] Error 2
make: *** [lib] Error 2
Makefile:7: recipe for target 'lib' failed
Cleaning up project directory and file based variables
ERROR: Job failed: exit code 1

failed
GQMCT_Buster_conv Warnconv
Error: #warning "You are compiling entanglement without MPI. No results possible" [-Werror=cpp]
f951: all warnings being treated as errors
make[2]: *** [Makefile:13: entanglement_mod.o] Error 1
make[2]: Leaving directory '/builds/ALF/ALF/Libraries/Modules'
make[1]: *** [Makefile:4: all] Error 2
make[1]: Leaving directory '/builds/ALF/ALF/Libraries'
make: *** [Makefile:7: lib] Error 2
Cleaning up project directory and file based variables
ERROR: Job failed: exit code 1

failed
GQMCT_Bullseye_OpenBlas_conv Warnconv
Error: #warning "You are compiling entanglement without MPI. No results possible" [-Werror=cpp]
f951: all warnings being treated as errors
make[2]: *** [Makefile:13: entanglement_mod.o] Error 1
make[2]: Leaving directory '/builds/ALF/ALF/Libraries/Modules'
make[1]: *** [Makefile:4: all] Error 2
make[1]: Leaving directory '/builds/ALF/ALF/Libraries'
make: *** [Makefile:7: lib] Error 2
Cleaning up project directory and file based variables
ERROR: Job failed: exit code 1

failed
GQMCT_Bullseye_conv Warnconv
Error: #warning "You are compiling entanglement without MPI. No results possible" [-Werror=cpp]
f951: all warnings being treated as errors
make[2]: Leaving directory '/builds/ALF/ALF/Libraries/Modules'
make[2]: *** [Makefile:13: entanglement_mod.o] Error 1
make[1]: *** [Makefile:4: all] Error 2
make[1]: Leaving directory '/builds/ALF/ALF/Libraries'
make: *** [Makefile:7: lib] Error 2
Cleaning up project directory and file based variables
ERROR: Job failed: exit code 1