dutifully introduce and use a function for the reverse adjoint

21 jobs for 208-rework-hop_mod-and-wrapgrup-and-wrapgrdo in 15 minutes and 9 seconds (queued for 4 seconds)
latest
Name Stage Failure
failed
GQMCT_Buster_conv Warnconv
Error: #warning "You are compiling entanglement without MPI. No results possible" [-Werror=cpp]
f951: all warnings being treated as errors
make[2]: Leaving directory '/builds/ALF/ALF/Libraries/Modules'
make[2]: *** [Makefile:13: entanglement_mod.o] Error 1
make[1]: *** [Makefile:4: all] Error 2
make[1]: Leaving directory '/builds/ALF/ALF/Libraries'
make: *** [Makefile:7: lib] Error 2
Cleaning up project directory and file based variables
ERROR: Job failed: exit code 1

failed
GQMCT_Stretch_conv Warnconv
make[2]: Leaving directory '/builds/ALF/ALF/Libraries/Modules'
make[1]: *** [all] Error 2
Makefile:4: recipe for target 'all' failed
make[1]: Leaving directory '/builds/ALF/ALF/Libraries'
Makefile:7: recipe for target 'lib' failed
make: *** [lib] Error 2
Cleaning up project directory and file based variables
ERROR: Failed to cleanup volumes
ERROR: Job failed: exit code 1

failed
GQMCT_Bullseye_OpenBlas_conv Warnconv
Error: #warning "You are compiling entanglement without MPI. No results possible" [-Werror=cpp]
f951: all warnings being treated as errors
make[2]: *** [Makefile:13: entanglement_mod.o] Error 1
make[2]: Leaving directory '/builds/ALF/ALF/Libraries/Modules'
make[1]: *** [Makefile:4: all] Error 2
make[1]: Leaving directory '/builds/ALF/ALF/Libraries'
make: *** [Makefile:7: lib] Error 2
Cleaning up project directory and file based variables
ERROR: Job failed: exit code 1

failed
GQMCT_Bullseye_conv Warnconv
Error: #warning "You are compiling entanglement without MPI. No results possible" [-Werror=cpp]
f951: all warnings being treated as errors
make[2]: *** [Makefile:13: entanglement_mod.o] Error 1
make[2]: Leaving directory '/builds/ALF/ALF/Libraries/Modules'
make[1]: *** [Makefile:4: all] Error 2
make[1]: Leaving directory '/builds/ALF/ALF/Libraries'
make: *** [Makefile:7: lib] Error 2
Cleaning up project directory and file based variables
ERROR: Job failed: exit code 1