Merge branch '76-ssh-model' of git.physik.uni-wuerzburg.de:marqov/marqov into 76-ssh-model

5 jobs for 76-ssh-model in 6 minutes and 3 seconds (queued for 1 second)
latest
Status Name Job ID Coverage
  Build
failed marqov_Buster #169008

00:05:31

failed marqov_Buster_clang #169009

00:01:25

failed marqov_Buster_pgi #169010

00:01:49

failed marqov_Stretch #169007

00:02:47

failed marqov_Ubuntu_bionic #169006

00:06:03

 
Name Stage Failure
failed
marqov_Buster_pgi Build
make[3]: *** [src/CMakeFiles/MARQOV.dir/build.make:89: src/CMakeFiles/MARQOV.dir/main.cpp.o] Error 2
make[2]: *** [CMakeFiles/Makefile2:93: src/CMakeFiles/MARQOV.dir/all] Error 2
make[1]: *** [CMakeFiles/Makefile2:105: src/CMakeFiles/MARQOV.dir/rule] Error 2
make: *** [Makefile:118: MARQOV] Error 2
make[3]: Leaving directory '/builds/marqov/marqov/build'
make[2]: Leaving directory '/builds/marqov/marqov/build'
make[1]: Leaving directory '/builds/marqov/marqov/build'
Cleaning up file based variables
ERROR: Job failed: exit code 1
failed
marqov_Buster_clang Build
make[3]: *** [src/CMakeFiles/MARQOV.dir/build.make:89: src/CMakeFiles/MARQOV.dir/main.cpp.o] Error 1
make[3]: Leaving directory '/builds/marqov/marqov/build'
make[2]: *** [CMakeFiles/Makefile2:93: src/CMakeFiles/MARQOV.dir/all] Error 2
make[2]: Leaving directory '/builds/marqov/marqov/build'
make[1]: *** [CMakeFiles/Makefile2:105: src/CMakeFiles/MARQOV.dir/rule] Error 2
make[1]: Leaving directory '/builds/marqov/marqov/build'
make: *** [Makefile:118: MARQOV] Error 2
Cleaning up file based variables
ERROR: Job failed: exit code 1
failed
marqov_Buster Build
/builds/marqov/marqov/src/main.cpp:164:8: error: request for member 'start' in 'sched', which is of non-class type 'int'
sched.start();
^~~~~
make[3]: *** [src/CMakeFiles/mpiMARQOV.dir/build.make:89: src/CMakeFiles/mpiMARQOV.dir/main.cpp.o] Error 1
make[2]: *** [CMakeFiles/Makefile2:130: src/CMakeFiles/mpiMARQOV.dir/all] Error 2
make[1]: *** [CMakeFiles/Makefile2:142: src/CMakeFiles/mpiMARQOV.dir/rule] Error 2
make: *** [Makefile:131: mpiMARQOV] Error 2
Cleaning up file based variables
ERROR: Job failed: exit code 1
failed
marqov_Stretch Build
make[3]: *** [src/CMakeFiles/mpiMARQOV.dir/main.cpp.o] Error 1
CMakeFiles/Makefile2:87: recipe for target 'src/CMakeFiles/mpiMARQOV.dir/all' failed
make[2]: *** [src/CMakeFiles/mpiMARQOV.dir/all] Error 2
CMakeFiles/Makefile2:99: recipe for target 'src/CMakeFiles/mpiMARQOV.dir/rule' failed
make[1]: *** [src/CMakeFiles/mpiMARQOV.dir/rule] Error 2
Makefile:118: recipe for target 'mpiMARQOV' failed
make: *** [mpiMARQOV] Error 2
Cleaning up file based variables
ERROR: Job failed: exit code 1
failed
marqov_Ubuntu_bionic Build
make[3]: *** [src/CMakeFiles/mpiMARQOV.dir/main.cpp.o] Error 1
make[2]: *** [src/CMakeFiles/mpiMARQOV.dir/all] Error 2
CMakeFiles/Makefile2:124: recipe for target 'src/CMakeFiles/mpiMARQOV.dir/all' failed
make[1]: *** [src/CMakeFiles/mpiMARQOV.dir/rule] Error 2
CMakeFiles/Makefile2:136: recipe for target 'src/CMakeFiles/mpiMARQOV.dir/rule' failed
Makefile:131: recipe for target 'mpiMARQOV' failed
make: *** [mpiMARQOV] Error 2
Cleaning up file based variables
ERROR: Job failed: exit code 1