fixed previously introduced bug

5 jobs for 14-parallelization in 5 minutes and 45 seconds
Name Stage Failure
failed
marqov_Ubuntu_bionic Build
CMakeFiles/Makefile2:124: recipe for target 'src/CMakeFiles/mpiMARQOV.dir/all' failed
make[2]: *** [src/CMakeFiles/mpiMARQOV.dir/all] Error 2
CMakeFiles/Makefile2:136: recipe for target 'src/CMakeFiles/mpiMARQOV.dir/rule' failed
make[1]: *** [src/CMakeFiles/mpiMARQOV.dir/rule] Error 2
Makefile:131: recipe for target 'mpiMARQOV' failed
make: *** [mpiMARQOV] Error 2
Running after_script
Uploading artifacts for failed job
ERROR: Job failed: exit code 1
failed
marqov_Buster Build
/usr/bin/ld: main.cpp:(.text+0x1e07): undefined reference to `omp_get_thread_num'
collect2: error: ld returned 1 exit status
make[3]: *** [src/CMakeFiles/mpiMARQOV.dir/build.make:108: src/mpiMARQOV] Error 1
make[2]: *** [CMakeFiles/Makefile2:130: src/CMakeFiles/mpiMARQOV.dir/all] Error 2
make[1]: *** [CMakeFiles/Makefile2:142: src/CMakeFiles/mpiMARQOV.dir/rule] Error 2
make: *** [Makefile:131: mpiMARQOV] Error 2
Running after_script
Uploading artifacts for failed job
ERROR: Job failed: exit code 1
failed
marqov_Stretch Build
make[2]: *** [src/CMakeFiles/mpiMARQOV.dir/all] Error 2
CMakeFiles/Makefile2:87: recipe for target 'src/CMakeFiles/mpiMARQOV.dir/all' failed
make[1]: *** [src/CMakeFiles/mpiMARQOV.dir/rule] Error 2
CMakeFiles/Makefile2:99: recipe for target 'src/CMakeFiles/mpiMARQOV.dir/rule' failed
make: *** [mpiMARQOV] Error 2
Makefile:118: recipe for target 'mpiMARQOV' failed
Running after_script
Uploading artifacts for failed job
ERROR: Job failed: exit code 1
failed
marqov_Ubuntu_xenial Build
CMakeFiles/Makefile2:87: recipe for target 'src/CMakeFiles/mpiMARQOV.dir/all' failed
make[2]: *** [src/CMakeFiles/mpiMARQOV.dir/all] Error 2
CMakeFiles/Makefile2:99: recipe for target 'src/CMakeFiles/mpiMARQOV.dir/rule' failed
make[1]: *** [src/CMakeFiles/mpiMARQOV.dir/rule] Error 2
make: *** [mpiMARQOV] Error 2
Makefile:118: recipe for target 'mpiMARQOV' failed
Running after_script
Uploading artifacts for failed job
ERROR: Job failed: exit code 1