rely on functions that are actually in use in MARQOV

5 jobs for 31-dangerous-bug-in-metropolis in 5 minutes and 36 seconds (queued for 2 seconds)
Name Stage Failure
failed
marqov_Ubuntu_xenial Build
CMakeFiles/Makefile2:87: recipe for target 'src/CMakeFiles/mpiMARQOV.dir/all' failed
make[2]: *** [src/CMakeFiles/mpiMARQOV.dir/all] Error 2
make[1]: *** [src/CMakeFiles/mpiMARQOV.dir/rule] Error 2
CMakeFiles/Makefile2:99: recipe for target 'src/CMakeFiles/mpiMARQOV.dir/rule' failed
Makefile:118: recipe for target 'mpiMARQOV' failed
make: *** [mpiMARQOV] Error 2
Running after_script
Uploading artifacts for failed job
ERROR: Job failed: exit code 1
failed
marqov_Stretch Build
make[2]: *** [src/CMakeFiles/mpiMARQOV.dir/all] Error 2
CMakeFiles/Makefile2:87: recipe for target 'src/CMakeFiles/mpiMARQOV.dir/all' failed
CMakeFiles/Makefile2:99: recipe for target 'src/CMakeFiles/mpiMARQOV.dir/rule' failed
make[1]: *** [src/CMakeFiles/mpiMARQOV.dir/rule] Error 2
make: *** [mpiMARQOV] Error 2
Makefile:118: recipe for target 'mpiMARQOV' failed
Running after_script
Uploading artifacts for failed job
ERROR: Job failed: exit code 1