test the scaling functionality

5 jobs for 43-encapsulate-rng in 5 minutes and 8 seconds
Name Stage Failure
failed
marqov_Ubuntu_xenial Build
make[1]: *** [src/CMakeFiles/mpiMARQOV.dir/rule] Error 2
make: *** [mpiMARQOV] Error 2
src/CMakeFiles/mpiMARQOV.dir/build.make:127: recipe for target 'src/mpiMARQOV' failed
CMakeFiles/Makefile2:87: recipe for target 'src/CMakeFiles/mpiMARQOV.dir/all' failed
CMakeFiles/Makefile2:99: recipe for target 'src/CMakeFiles/mpiMARQOV.dir/rule' failed
Makefile:118: recipe for target 'mpiMARQOV' failed
Running after_script
Uploading artifacts for failed job
ERROR: Job failed: exit code 1
failed
marqov_Stretch Build
make[1]: *** [src/CMakeFiles/mpiMARQOV.dir/rule] Error 2
make: *** [mpiMARQOV] Error 2
src/CMakeFiles/mpiMARQOV.dir/build.make:127: recipe for target 'src/mpiMARQOV' failed
CMakeFiles/Makefile2:87: recipe for target 'src/CMakeFiles/mpiMARQOV.dir/all' failed
CMakeFiles/Makefile2:99: recipe for target 'src/CMakeFiles/mpiMARQOV.dir/rule' failed
Makefile:118: recipe for target 'mpiMARQOV' failed
Running after_script
Uploading artifacts for failed job
ERROR: Job failed: exit code 1