tidy up marqov.h

5 jobs for 45-unify-disordered-lattice-interfaces in 4 minutes and 25 seconds (queued for 1 second)
Name Stage Failure
failed
marqov_Stretch Build
CMakeFiles/Makefile2:87: recipe for target 'src/CMakeFiles/mpiMARQOV.dir/all' failed
make[2]: *** [src/CMakeFiles/mpiMARQOV.dir/all] Error 2
make[1]: *** [src/CMakeFiles/mpiMARQOV.dir/rule] Error 2
CMakeFiles/Makefile2:99: recipe for target 'src/CMakeFiles/mpiMARQOV.dir/rule' failed
make: *** [mpiMARQOV] Error 2
Makefile:118: recipe for target 'mpiMARQOV' failed
Running after_script
Uploading artifacts for failed job
ERROR: Job failed: exit code 1
failed
marqov_Ubuntu_xenial Build
make[2]: *** [src/CMakeFiles/mpiMARQOV.dir/all] Error 2
CMakeFiles/Makefile2:87: recipe for target 'src/CMakeFiles/mpiMARQOV.dir/all' failed
make[1]: *** [src/CMakeFiles/mpiMARQOV.dir/rule] Error 2
CMakeFiles/Makefile2:99: recipe for target 'src/CMakeFiles/mpiMARQOV.dir/rule' failed
make: *** [mpiMARQOV] Error 2
Makefile:118: recipe for target 'mpiMARQOV' failed
Running after_script
Uploading artifacts for failed job
ERROR: Job failed: exit code 1