some fallback

5 jobs for 61-hdf5-i-o-version-2 in 6 minutes and 6 seconds (queued for 1 second)
Name Stage Failure
failed
marqov_Ubuntu_xenial Build
src/CMakeFiles/mpiMARQOV.dir/build.make:153: recipe for target 'src/mpiMARQOV' failed
make[3]: *** [src/mpiMARQOV] Error 1
CMakeFiles/Makefile2:87: recipe for target 'src/CMakeFiles/mpiMARQOV.dir/all' failed
make[2]: *** [src/CMakeFiles/mpiMARQOV.dir/all] Error 2
CMakeFiles/Makefile2:99: recipe for target 'src/CMakeFiles/mpiMARQOV.dir/rule' failed
make[1]: *** [src/CMakeFiles/mpiMARQOV.dir/rule] Error 2
Makefile:118: recipe for target 'mpiMARQOV' failed
make: *** [mpiMARQOV] Error 2
ERROR: Job failed: exit code 1
failed
marqov_Stretch Build
src/CMakeFiles/mpiMARQOV.dir/build.make:153: recipe for target 'src/mpiMARQOV' failed
make[3]: *** [src/mpiMARQOV] Error 1
CMakeFiles/Makefile2:87: recipe for target 'src/CMakeFiles/mpiMARQOV.dir/all' failed
make[2]: *** [src/CMakeFiles/mpiMARQOV.dir/all] Error 2
CMakeFiles/Makefile2:99: recipe for target 'src/CMakeFiles/mpiMARQOV.dir/rule' failed
make[1]: *** [src/CMakeFiles/mpiMARQOV.dir/rule] Error 2
Makefile:118: recipe for target 'mpiMARQOV' failed
make: *** [mpiMARQOV] Error 2
ERROR: Job failed: exit code 1